BDBM26303 4-aminopyrazole quinazoline, 3::N-(2,3-difluorophenyl)-2-{4-[(7-{3-[(2R)-2-(hydroxymethyl)pyrrolidin-1-yl]propoxy}-6-methoxyquinazolin-4-yl)amino]-1H-pyrazol-1-yl}acetamide
SMILES COc1cc2c(Nc3cnn(CC(=O)Nc4cccc(F)c4F)c3)ncnc2cc1OCCCN1CCC[C@@H]1CO
InChI Key InChIKey=YFGMURZUSPAEJH-LJQANCHMSA-N
Data  2 KI
  Tab Delimited (TSV)   2D SDfile   Computed 3D by Vconf -m prep SDfile
Find this compound or compounds like it in BindingDB:
Activity Spreadsheet -- Enzyme Inhibition Constant Data from BindingDB
Found 1 hit for monomerid = 26303
TargetAurora kinase A(Homo sapiens (Human))
Astrazeneca
LigandPNGBDBM26303(4-aminopyrazole quinazoline, 3 | N-(2,3-difluoroph...)
Affinity DataKi:  340nM ΔG°:  -8.73kcal/molepH: 7.5 T: 2°C. Assay description: In vitro kinase assay using recombinant Aurora A purified from Sf9 cells was incubated at room temperature with substrate, and test compounds in the ...
In DepthDetails ArticlePubMed